{"text_format":"2","workbook":"xlsx","n_sheets":5,"sheets":["765송부","345송부","154송부","한수원","중부"],"not_rendered":{"charts":0,"images":0,"macros":0,"external_links":0,"defined_names":9,"comments":0,"pivot_tables":0},"unopened":[],"bounds":{"document_bytes":16777216,"sheet_cells":100000,"run_cost":"one","rows_first":2000,"rows_last":500,"rows_between":2000,"halvings":0,"cell_chars":16384,"cell_head_chars":4096},"cells_cut":0,"cells_raw":0,"read":"whole","date_system":"1900"}

{"sheet":"765송부","index":0,"n_rows":9,"n_cols":16,"rows_kept":9,"cut":false,"hidden":false,"merged":[[2,15,3,15],[2,0,3,0],[2,1,3,1],[2,3,3,3],[2,10,3,10],[2,4,3,4],[2,5,3,5],[2,6,2,7],[2,8,2,9],[2,14,3,14],[2,12,3,12],[2,13,3,13],[2,2,3,2],[2,11,3,11]]}
[{"$f":"\"2018년도 \"&#REF!&\"월 휴전계획서\"","v":{"$error":"#REF!"}}]
["765kV"]
["번호","1차사업소","사업소","설비명","공사명","공사개요","신청일시",null,"조정일시",null,"작업구분","연간반영\n(Y/N)","처리결과\n(Y/N)","처리사유","Key-point","시송전설비\n 여부"]
[{"$nulls":6},"시작","종료","시작","종료"]
[1,"경기북부","구리","신안성신가평 T/L","신가평S/S 765kV Trench제 부싱단자 교체","신가평S/S 765kV Trench제 부싱단자 교체","2018-09-20 09:00","2018-09-20 18:00","2018-09-20 09:00","2018-09-20 18:00","당일",null,null,null,201807110216,"-"]
[2,"경기북부","구리","신태백신가평#2 T/L","신가평S/S 765kV Trench제 부싱단자 교체","신가평S/S 765kV Trench제 부싱단자 교체","2018-09-21 09:00","2018-09-21 18:00","2018-09-21 09:00","2018-09-21 18:00","당일",null,null,null,201807110217,"-"]
[3,"경기북부","구리","신태백신가평#1 T/L","신가평S/S 765kV Trench제 부싱단자 교체","신가평S/S 765kV Trench제 부싱단자 교체","2018-09-18 09:00","2018-09-19 09:00","2018-09-18 09:00","2018-09-19 18:00","연속",null,null,null,201807300092,"-"]
[4,"경기","성남","신서산신안성#1 T/L","765kV 신서산-신안성#1T/L 송전선로 정밀점검","765kV 신서산-신안성#1T/L 211~259호 송전선로 정밀점검","2018-09-27 08:00","2018-10-02 18:00","취소","취소","연속",null,null,null,201807040130,"-"]
[5,"대전충남","서산","신서산S/S #3 M.Tr A-2","765kV M.Tr 2차측 장경간 구조개선 공사","765kV M.Tr 2차측 장경간 구조개선 공사","2018-09-17 09:00","2018-10-26 18:00","2018-09-17 09:00","2018-10-26 18:00","연속",null,null,null,201807120007,"-"]

{"sheet":"345송부","index":1,"n_rows":234,"n_cols":16,"rows_kept":234,"cut":false,"hidden":false,"merged":[[2,15,3,15],[2,14,3,14],[2,0,3,0],[2,1,3,1],[2,3,3,3],[2,10,3,10],[2,4,3,4],[2,5,3,5],[2,6,2,7],[2,8,2,9],[2,12,3,12],[2,13,3,13],[2,2,3,2],[2,11,3,11]]}
[{"$f":"\"2018년도 \"&#REF!&\"월 휴전계획서\"","v":{"$error":"#REF!"}}]
["345kV"]
["번호","1차사업소","사업소","설비명","공사명","공사개요","신청일시",null,"조정일시",null,"작업구분","연간반영\n(Y/N)","처리결과\n(Y/N)","처리사유","Key-point","시송전설비\n여부"]
[{"$nulls":6},"시작","종료","시작","종료"]
[1,"서울","성동","성동S/S #2 M.Tr A","18년 성동P/O 변전협력회사 총액공사","- 주변압기 보통점검(성동S/S #2M.Tr)","2018-09-19 09:30","2018-09-20 17:00","2018-09-19 09:30","2018-09-20 17:00","연속",null,null,null,201807130104,{"$f":"IF(ISERROR(VLOOKUP(D5,#REF!,13,0)),\"-\",VLOOKUP(D5,#REF!,13,0))","v":"-"}]
[2,"남서울","영등포","신광명S/S #1 M.Tr A","영서S/S 154kV 이하 옥외철구 GIS화 공사","상부 가공지선 정비 이격거리 확보","2018-09-11 09:00","2018-09-11 18:00","2018-09-11 09:00","2018-09-11 18:00","당일",null,null,null,201807190050,{"$f":"IF(ISERROR(VLOOKUP(D6,#REF!,13,0)),\"-\",VLOOKUP(D6,#REF!,13,0))","v":"-"}]
[3,"남서울","영등포","신광명S/S #4 M.Tr A","영서S/S 154kV 이하 옥외철구 GIS화 공사","상부 가공지선 정비 이격거리 확보","2018-09-14 09:00","2018-09-14 18:00","2018-09-14 09:00","2018-09-14 18:00","당일",null,null,null,201807190053,{"$f":"IF(ISERROR(VLOOKUP(D7,#REF!,13,0)),\"-\",VLOOKUP(D7,#REF!,13,0))","v":"-"}]
[4,"남서울","영등포","신광명S/S #3 M.Tr A","영서S/S 154kV 이하 옥외철구 GIS화 공사","상부 가공지선 정비 이격거리 확보","2018-09-13 09:00","2018-09-13 18:00","2018-09-13 09:00","2018-09-13 18:00","당일",null,null,null,201807190052,{"$f":"IF(ISERROR(VLOOKUP(D8,#REF!,13,0)),\"-\",VLOOKUP(D8,#REF!,13,0))","v":"-"}]
[5,"남서울","영등포","신광명S/S #2 M.Tr A","영서S/S 154kV 이하 옥외철구 GIS화 공사","상부 가공지선 정비 이격거리 확보","2018-09-12 09:00","2018-09-12 18:00","2018-09-12 09:00","2018-09-12 18:00","당일",null,null,null,201807190051,{"$f":"IF(ISERROR(VLOOKUP(D9,#REF!,13,0)),\"-\",VLOOKUP(D9,#REF!,13,0))","v":"-"}]
[6,"남서울","영등포","신광명영등포#2 T/L","345kV 신광명-영등포#2T/L EBG 해체점검","345kV 신광명-영등포#2T/L EBG 해체점검 - 신광명EBG (2개소), 영등포EBG (3개소)","2018-09-21 18:00","2018-09-28 18:00","2018-09-21 18:00","2018-09-28 18:00","연속",null,null,null,201807060129,{"$f":"IF(ISERROR(VLOOKUP(D10,#REF!,13,0)),\"-\",VLOOKUP(D10,#REF!,13,0))","v":"-"}]
[7,"남서울","직할","신광명영등포#1 T/L","345kV T/L 보호반 교체","신광명-영등포#1T/L 보호반 교체","2018-09-28 18:00","2018-10-03 18:00","2018-09-28 18:00","2018-10-03 18:00","연속",null,null,null,201807090291,{"$f":"IF(ISERROR(VLOOKUP(D11,#REF!,13,0)),\"-\",VLOOKUP(D11,#REF!,13,0))","v":"-"}]
[8,"남서울","직할","영등포S/S #3 M.Tr A","(주)새롬프로텍 345kV 변압기 보호반 성능 개선","64V 관련 로직 수정","2018-09-04 16:00","2018-09-04 19:00","2018-09-04 16:00","2018-09-04 19:00","당일",null,null,null,201807240072,{"$f":"IF(ISERROR(VLOOKUP(D12,#REF!,13,0)),\"-\",VLOOKUP(D12,#REF!,13,0))","v":"-"}]
[9,"남서울","직할","영등포S/S #2 M.Tr A","(주)새롬프로텍 345kV 변압기 보호반 성능 개선","64V 관련 로직 수정","2018-09-04 13:00","2018-09-04 16:00","2018-09-04 13:00","2018-09-04 16:00","당일",null,null,null,201807240071,{"$f":"IF(ISERROR(VLOOKUP(D13,#REF!,13,0)),\"-\",VLOOKUP(D13,#REF!,13,0))","v":"-"}]
[10,"남서울","직할","영등포S/S #1 M.Tr A","(주)새롬프로텍 345kV 변압기 보호반 성능 개선","64V 관련 로직 수정","2018-09-04 09:00","2018-09-04 13:00","2018-09-04 09:00","2018-09-04 13:00","당일",null,null,null,201807240068,{"$f":"IF(ISERROR(VLOOKUP(D14,#REF!,13,0)),\"-\",VLOOKUP(D14,#REF!,13,0))","v":"-"}]
[11,"인천","직할","서인천CC신부평#1 T/L","345kV 서인천CC-신부평#1T/L OF케이블 절연유 채취밸브 설치공사","J/B#30 등 3개소 절연유 채취밸브 설치","2018-09-17 09:00","2018-09-18 18:00","취소","취소","연속",null,null,null,201807230010,{"$f":"IF(ISERROR(VLOOKUP(D15,#REF!,13,0)),\"-\",VLOOKUP(D15,#REF!,13,0))","v":"-"}]
[12,"인천","직할","서인천CC신부평#2 T/L","345kV 서인천CC-신부평#2T/L OF케이블 절연유 채취밸브 설치공사","J/B#24 등 9개소 절연유 채취밸브 설치","2018-09-19 09:00","2018-09-20 18:00","취소","취소","연속",null,null,null,201807230012,{"$f":"IF(ISERROR(VLOOKUP(D16,#REF!,13,0)),\"-\",VLOOKUP(D16,#REF!,13,0))","v":"-"}]
[13,"인천","직할","서인천CC신부평#3 T/L","345kV 서인천CC-신부평#3T/L OF케이블 절연유 채취밸브 설치공사","J/B#24 등 9개소 절연유 채취밸브 설치","2018-09-27 09:00","2018-09-28 18:00","취소","취소","연속",null,null,null,201807230013,{"$f":"IF(ISERROR(VLOOKUP(D17,#REF!,13,0)),\"-\",VLOOKUP(D17,#REF!,13,0))","v":"-"}]
[14,"인천","인천","신가좌S/S #1 M.Tr A","신가좌S/S 345㎸ 용량부족 GIS 대체공사","신가좌S/S 345㎸ 용량부족 GIS 대체공사 - 71Bay 철거 및 설치 (3CB) - 제어케이블 분리 및 결선 - 기타 부대작업","2018-09-03 09:00","2018-12-21 18:00","2018-09-15 08:00","2018-11-25 18:00","연속",null,null,null,201807020051,{"$f":"IF(ISERROR(VLOOKUP(D18,#REF!,13,0)),\"-\",VLOOKUP(D18,#REF!,13,0))","v":"-"}]
[15,"인천","인천","신가좌S/S 345kV #1 BUS","신가좌S/S 345㎸ 용량부족 GIS 대체공사","신가좌S/S 345㎸ 용량부족 GIS 대체공사 - 실부하 가압 관련 앵글 측정","2018-09-14 13:00","2018-09-14 16:00","2018-09-27 08:00","2018-10-10 18:00","연속",null,null,null,201804030076,{"$f":"IF(ISERROR(VLOOKUP(D19,#REF!,13,0)),\"-\",VLOOKUP(D19,#REF!,13,0))","v":"-"}]
[16,"인천","인천","신가좌S/S 345kV #2 BUS","신가좌S/S 345㎸ 용량부족 GIS 대체공사","신가좌S/S 345㎸ 용량부족 GIS 대체공사 - 실부하 가압 관련 앵글 측정","2018-09-14 16:00","2018-09-14 18:00","취소","취소","당일",null,null,null,201804030077,{"$f":"IF(ISERROR(VLOOKUP(D20,#REF!,13,0)),\"-\",VLOOKUP(D20,#REF!,13,0))","v":"-"}]
[17,"인천","인천","신가좌S/S 신가좌신시흥#2T/L GIS","2018년 인천전력지사 362㎸ GIS 정밀점검","신가좌S/S 7471 GIS 정밀점검","2018-09-14 09:00","2018-09-16 18:00","취소","취소","연속",null,null,null,201807060108,{"$f":"IF(ISERROR(VLOOKUP(D21,#REF!,13,0)),\"-\",VLOOKUP(D21,#REF!,13,0))","v":"-"}]
[18,"인천","인천","신가좌가정#2 T/L","신가좌S/S 345㎸ 용량부족 GIS 대체공사","신가좌S/S 345㎸ 용량부족 GIS 대체공사 - 71Bay 철거 및 설치 (3CB) - 제어케이블 분리 및 결선 - 기타 부대작업","2018-09-03 09:00","2018-12-21 18:00","2018-09-15 08:00","2018-11-25 18:00","연속",null,null,null,201807020050,{"$f":"IF(ISERROR(VLOOKUP(D22,#REF!,13,0)),\"-\",VLOOKUP(D22,#REF!,13,0))","v":"-"}]
[19,"인천","시흥","신가좌신시흥#1 T/L","345kV 신가좌-신시흥(신시흥-신광명)T/L 지장송전선로 이설공사","■ 휴전일정(임시선로 구성) ○ 1차 휴전(5일간) - (상단) 345kV 신시흥-신광명 #2T/L No.34~38 - (하단) 345kV 신가좌-신시흥 #2T/L No.57~61 ○ 2차 휴전(5일간) - (상단) 345kV 신시흥-신광명 #1T/L No.34~38 - (하단) 345kV 신가좌-신시흥 #1T/L No.57~61","2018-09-16 06:00","2018-09-20 18:00","취소","취소","연속",null,null,null,201807120162,{"$f":"IF(ISERROR(VLOOKUP(D23,#REF!,13,0)),\"-\",VLOOKUP(D23,#REF!,13,0))","v":"-"}]
[20,"인천","시흥","신가좌신시흥#2 T/L","345kV 신가좌-신시흥(신시흥-신광명)T/L 지장송전선로 이설공사","■ 휴전일정(임시선로 구성) ○ 1차 휴전(5일간) - (상단) 345kV 신시흥-신광명 #2T/L No.34~38 - (하단) 345kV 신가좌-신시흥 #2T/L No.57~61 ○ 2차 휴전(5일간) - (상단) 345kV 신시흥-신광명 #1T/L No.34~38 - (하단) 345kV 신가좌-신시흥 #1T/L No.57~61","2018-09-11 06:00","2018-09-15 18:00","취소","취소","연속",null,null,null,201807120160,{"$f":"IF(ISERROR(VLOOKUP(D24,#REF!,13,0)),\"-\",VLOOKUP(D24,#REF!,13,0))","v":"-"}]
[21,"인천","인천","신가좌신시흥#2T/L-#3 M.Tr 1차 GIS","2018년 인천전력지사 362㎸ GIS 정밀점검","신가좌S/S 7400 GIS 정밀점검","2018-09-11 09:00","2018-09-13 18:00","취소","취소","연속",null,null,null,201807060107,{"$f":"IF(ISERROR(VLOOKUP(D25,#REF!,13,0)),\"-\",VLOOKUP(D25,#REF!,13,0))","v":"-"}]
[22,"인천","인천","신경서S/S 345kV #1 BUS","2018년 인천전력지사 362㎸ GIS 정밀점검","신경서S/S 7171 GIS 정밀점검 - 7171 CB, 7151 DS 정밀점검","2018-09-18 09:00","2018-09-21 18:00","2018-09-18 09:00","2018-09-21 18:00","연속",null,null,null,201807060109,{"$f":"IF(ISERROR(VLOOKUP(D26,#REF!,13,0)),\"-\",VLOOKUP(D26,#REF!,13,0))","v":"-"}]
[23,"인천","인천","신경서S/S 신경서신인천CCT/L GIS","2018년 인천전력지사 362㎸ GIS 정밀점검","신경서S/S 7171 GIS 정밀점검","2018-09-18 09:00","2018-09-21 18:00","2018-09-18 09:00","2018-09-21 18:00","연속",null,null,null,201807060110,{"$f":"IF(ISERROR(VLOOKUP(D27,#REF!,13,0)),\"-\",VLOOKUP(D27,#REF!,13,0))","v":"-"}]
[24,"인천","김포","신김포S/S 345kV #3Sh.R","신김포S/S 345kV #3Sh.R 보통점검","신김포S/S 345kV #3Sh.R 보통점검","2018-09-11 09:00","2018-09-11 18:00","2018-09-11 09:00","2018-09-11 18:00","당일",null,null,null,201807030163,{"$f":"IF(ISERROR(VLOOKUP(D28,#REF!,13,0)),\"-\",VLOOKUP(D28,#REF!,13,0))","v":"-"}]
[25,"인천","직할","신부평S/S 345kV #1 Sh.R","신부평S/S 345kV #1Sh.R 보통점검","신부평S/S 345kV #1Sh.R 보통점검","2018-09-20 09:00","2018-09-21 18:00","2018-09-20 09:00","2018-09-21 18:00","연속",null,null,null,201807120061,{"$f":"IF(ISERROR(VLOOKUP(D29,#REF!,13,0)),\"-\",VLOOKUP(D29,#REF!,13,0))","v":"-"}]
[26,"인천","시흥","신시흥#1S/S #3 M.Tr A","신시흥#1S/S #3 M.Tr 2차GIS 정밀점검","신시흥#1S/S #3 M.Tr 2차GIS 정밀점검","2018-09-12 08:00","2018-09-14 18:00","2018-09-15 08:00","2018-09-16 18:00","연속",null,null,null,201807120032,{"$f":"IF(ISERROR(VLOOKUP(D30,#REF!,13,0)),\"-\",VLOOKUP(D30,#REF!,13,0))","v":"-"}]
[27,"인천","시흥","신시흥#2S/S #4 M.Tr A","신시흥#1S/S #4 M.Tr 2차GIS 정밀점검","신시흥#1S/S #4 M.Tr 2차GIS 정밀점검","2018-09-17 08:00","2018-09-20 18:00","2018-09-17 08:00","2018-09-20 18:00","연속",null,null,null,201807120034,{"$f":"IF(ISERROR(VLOOKUP(D31,#REF!,13,0)),\"-\",VLOOKUP(D31,#REF!,13,0))","v":"-"}]
[28,"인천","시흥","신시흥#2S/S #5M.Tr A","신시흥S/S 2-1,2 COMP 대체 관련 이격거리 확보용","신시흥S/S 2-1,2 COMP 대체 관련 이격거리 확보용","2018-09-28 09:00","2018-09-28 18:00","2018-09-28 09:00","2018-09-28 18:00","당일",null,null,null,201807120042,{"$f":"IF(ISERROR(VLOOKUP(D32,#REF!,13,0)),\"-\",VLOOKUP(D32,#REF!,13,0))","v":"-"}]
[29,"인천","시흥","신시흥신광명#1 T/L","345kV 신가좌-신시흥(신시흥-신광명)T/L 지장송전선로 이설공사","■ 휴전일정(임시선로 구성) ○ 1차 휴전(5일간) - (상단) 345kV 신시흥-신광명 #2T/L No.34~38 - (하단) 345kV 신가좌-신시흥 #2T/L No.57~61 ○ 2차 휴전(5일간) - (상단) 345kV 신시흥-신광명 #1T/L No.34~38 - (하단) 345kV 신가좌-신시흥 #1T/L No.57~61","2018-09-16 06:00","2018-09-20 18:00","취소","취소","연속",null,null,null,201807120163,{"$f":"IF(ISERROR(VLOOKUP(D33,#REF!,13,0)),\"-\",VLOOKUP(D33,#REF!,13,0))","v":"-"}]
[30,"인천","시흥","신시흥신광명#2 T/L","345kV 신가좌-신시흥(신시흥-신광명)T/L 지장송전선로 이설공사","■ 휴전일정(임시선로 구성) ○ 1차 휴전(5일간) - (상단) 345kV 신시흥-신광명 #2T/L No.34~38 - (하단) 345kV 신가좌-신시흥 #2T/L No.57~61 ○ 2차 휴전(5일간) - (상단) 345kV 신시흥-신광명 #1T/L No.34~38 - (하단) 345kV 신가좌-신시흥 #12T/L No.57~61","2018-09-11 06:00","2018-09-15 18:00","취소","취소","연속",null,null,null,201807120161,{"$f":"IF(ISERROR(VLOOKUP(D34,#REF!,13,0)),\"-\",VLOOKUP(D34,#REF!,13,0))","v":"-"}]
[31,"인천","시흥","영흥T/P #1 TIE Tr 1차 CB (7371)","영흥T/P #1 TIE Tr 1차 CB (7371) 동작점검","영흥T/P #1 TIE Tr 1차 CB (7371) 동작점검","2018-09-03 10:30","2018-09-03 18:00","2018-09-03 10:30","2018-09-03 18:00","당일",null,null,null,201807250027,{"$f":"IF(ISERROR(VLOOKUP(D35,#REF!,13,0)),\"-\",VLOOKUP(D35,#REF!,13,0))","v":"-"}]
[32,"인천","인천","인천CC S/Y 345KV #1Sh.R CB","345KV 인천CC Sh.R 설치공사","7272 보호게전기 연동시험 및 Sh.R 초기가압","2018-09-17 10:00","2018-09-18 10:00","2018-09-17 10:00","2018-09-18 10:00","연속",null,null,null,201807110004,{"$f":"IF(ISERROR(VLOOKUP(D36,#REF!,13,0)),\"-\",VLOOKUP(D36,#REF!,13,0))","v":"-"}]
[33,"인천","인천","인천CC S/Y 345kV #71 BUS","인천CC Sh.R 설치 공사","7351 DS 연결","2018-09-03 10:00","2018-09-10 18:00","2018-09-03 10:00","2018-09-10 10:00","연속",null,null,null,201807160124,{"$f":"IF(ISERROR(VLOOKUP(D37,#REF!,13,0)),\"-\",VLOOKUP(D37,#REF!,13,0))","v":"-"}]
[34,"인천","인천","인천CC S/Y 345kV #76 BUS","인천CC Sh.R 설치 공사","7352 DS 연결","2018-09-10 10:00","2018-09-17 10:00","2018-09-10 10:00","2018-09-17 10:00","연속",null,null,null,201807160125,{"$f":"IF(ISERROR(VLOOKUP(D38,#REF!,13,0)),\"-\",VLOOKUP(D38,#REF!,13,0))","v":"-"}]
[35,"인천","인천","인천CC S/Y 345KV#2Sh.R CB","345KV 인천CC Sh.R 설치공사","Sh.R 초기가압","2018-09-18 10:00","2018-09-19 10:00","2018-09-18 10:00","2018-09-19 10:00","연속",null,null,null,201807110005,{"$f":"IF(ISERROR(VLOOKUP(D39,#REF!,13,0)),\"-\",VLOOKUP(D39,#REF!,13,0))","v":"-"}]
[36,"경기북부","고양","신파주신덕은#1 T/L","신덕은변전소 내진보강 공사","○ 라디에이터실 철골 브레이싱 추가 및 보강 : 14.3ton ○ 녹막이 페인트칠 : 287M2 ○ 쌍줄비계설치 : 783M2","2018-09-17 09:00","2018-09-21 18:00","2018-09-17 09:00","2018-09-21 18:00","연속",null,null,null,201807170025,{"$f":"IF(ISERROR(VLOOKUP(D40,#REF!,13,0)),\"-\",VLOOKUP(D40,#REF!,13,0))","v":"-"}]
{"$rows_left_out":195}
{"sheet":"154송부","index":2,"n_rows":421,"n_cols":16,"rows_kept":421,"cut":false,"hidden":false,"merged":[[2,15,3,15],[2,0,3,0],[2,1,3,1],[2,3,3,3],[2,10,3,10],[2,4,3,4],[2,5,3,5],[2,6,2,7],[2,8,2,9],[2,14,3,14],[2,12,3,12],[2,13,3,13],[2,2,3,2],[2,11,3,11]]}
[{"$f":"\"2018년도 \"&#REF!&\"월 휴전계획서\"","v":{"$error":"#REF!"}}]
["154kV"]
["번호","1차사업소","사업소","설비명","공사명","공사개요","신청일시",null,"조정일시",null,"작업구분","연간반영\n(Y/N)","처리결과\n(Y/N)","처리사유","Key-point","시송전설비\n여부"]
[{"$nulls":6},"시작","종료","시작","종료"]
[1,"서울","성동","성동군자#2 T/L","18년 군자S/S 장기사용 170kV GIS 교체공사(성동군자#2T/L)","2018년 군자S/S 장기사용 170kV GIS 교체공사(성동군자#2T/L)","2018-09-28 09:00","2018-10-15 18:00","2018-09-28 09:00","2018-10-15 18:00","연속"," ",null,null,201807160150,{"$f":"IF(ISERROR(VLOOKUP(D5,#REF!,13,0)),\"-\",VLOOKUP(D5,#REF!,13,0))","v":"-"}]
[2,"서울","성동","미금화양 T/L","18년 성동P/O 170KV GIS 조작시험","차단기 개폐타임 측정","2018-09-18 11:00","2018-09-18 12:00","2018-09-18 11:00","2018-09-18 12:00","당일",null,null,null,201807160192,{"$f":"IF(ISERROR(VLOOKUP(D6,#REF!,13,0)),\"-\",VLOOKUP(D6,#REF!,13,0))","v":"-"}]
[3,"서울","중부","중부당인리#1 T/L","2018년 중부P/O 170kV GIS 정밀점검공사","#1 BUS-TIE GIS(6100) 정밀점검 (시험가압)","2018-09-15 17:00","2018-09-15 18:00","2018-09-15 17:00","2018-09-15 18:00","당일",null,null,null,201807170136,{"$f":"IF(ISERROR(VLOOKUP(D7,#REF!,13,0)),\"-\",VLOOKUP(D7,#REF!,13,0))","v":"-"}]
[4,"서울","중부","중부당인리#1 T/L","2018년 중부P/O 170kV GIS 정밀점검공사","#3 M.Tr GIS(6333) 정밀점검 (시험가압)","2018-09-13 17:00","2018-09-13 18:00","2018-09-13 17:00","2018-09-13 18:00","당일",null,null,null,201807170132,{"$f":"IF(ISERROR(VLOOKUP(D8,#REF!,13,0)),\"-\",VLOOKUP(D8,#REF!,13,0))","v":"-"}]
[5,"서울","중부","중부당인리#2 T/L","2018년 중부P/O 170kV GIS 정밀점검공사","65-66BUS-SECTION 정밀점검 (시험가압)","2018-09-21 17:00","2018-09-21 18:00","2018-09-21 17:00","2018-09-21 18:00","당일",null,null,null,201807170147,{"$f":"IF(ISERROR(VLOOKUP(D9,#REF!,13,0)),\"-\",VLOOKUP(D9,#REF!,13,0))","v":"-"}]
[6,"서울","중부","당인리S/S 154kV #65 BUS","2018년 중부P/O 170kV GIS 정밀점검공사","65-66BUS-SECTION GIS 정밀점검 (시험가압)","2018-09-21 17:00","2018-09-21 18:00","2018-09-21 17:00","2018-09-21 18:00","당일",null,null,null,201807170144,{"$f":"IF(ISERROR(VLOOKUP(D10,#REF!,13,0)),\"-\",VLOOKUP(D10,#REF!,13,0))","v":"-"}]
[7,"서울","중부","중부당인리#1 T/L","2018년 중부P/O 170kV GIS 정밀점검공사","60-61BUS-SECTION GIS 정밀점검 (시험가압)","2018-09-17 17:00","2018-09-17 18:00","2018-09-17 17:00","2018-09-17 18:00","당일",null,null,null,201807170137,{"$f":"IF(ISERROR(VLOOKUP(D11,#REF!,13,0)),\"-\",VLOOKUP(D11,#REF!,13,0))","v":"-"}]
[8,"서울","중부","당인리S/S 60-61-0 SEC CB","2018년 중부P/O 170kV GIS 정밀점검공사","60-61 BUS-SECTION GIS 정밀점검","2018-09-16 08:00","2018-09-17 18:00","2018-09-16 08:00","2018-09-17 18:00","연속",null,null,null,201807170141,{"$f":"IF(ISERROR(VLOOKUP(D12,#REF!,13,0)),\"-\",VLOOKUP(D12,#REF!,13,0))","v":"-"}]
[9,"서울","중부","당인리S/S 154kV #60 BUS","2018년 중부P/O 170kV GIS 정밀점검공사","#3 M.Tr GIS(6333) 정밀점검 (시험가압)","2018-09-13 17:00","2018-09-13 18:00","2018-09-13 17:00","2018-09-13 18:00","당일",null,null,null,201807170133,{"$f":"IF(ISERROR(VLOOKUP(D13,#REF!,13,0)),\"-\",VLOOKUP(D13,#REF!,13,0))","v":"-"}]
[10,"서울","중부","당인리S/S 154kV #2 BUS TIE CB","2018년 중부P/O 170kV GIS 정밀점검공사","#2 BUS-TIE GIS(6200) GIS 정밀점검","2018-09-18 08:00","2018-09-19 18:00","2018-09-18 08:00","2018-09-19 18:00","연속",null,null,null,201807170142,{"$f":"IF(ISERROR(VLOOKUP(D14,#REF!,13,0)),\"-\",VLOOKUP(D14,#REF!,13,0))","v":"-"}]
[11,"서울","중부","당인리S/S 154kV #60 BUS","2018년 중부P/O 170kV GIS 정밀점검공사","#1 BUS-TIE GIS(6100) 정밀점검 (시험가압)","2018-09-15 17:00","2018-09-15 18:00","2018-09-15 17:00","2018-09-15 18:00","당일",null,null,null,201807170134,{"$f":"IF(ISERROR(VLOOKUP(D15,#REF!,13,0)),\"-\",VLOOKUP(D15,#REF!,13,0))","v":"-"}]
[12,"서울","중부","당인리S/S 154kV #1 BUS TIE CB","2018년 중부P/O 170kV GIS 정밀점검공사","#1 BUS-TIE GIS(6100) 정밀점검","2018-09-14 08:00","2018-09-15 18:00","2018-09-14 08:00","2018-09-15 18:00","연속",null,null,null,201807170139,{"$f":"IF(ISERROR(VLOOKUP(D16,#REF!,13,0)),\"-\",VLOOKUP(D16,#REF!,13,0))","v":"-"}]
[13,"서울","중부","당인리S/S 65-66-0 SEC CB","2018년 중부P/O 170kV GIS 정밀점검공사","65-66BUS-SECTION GIS 정밀점검","2018-09-20 08:00","2018-09-21 18:00","2018-09-20 08:00","2018-09-21 18:00","연속",null,null,null,201807170145,{"$f":"IF(ISERROR(VLOOKUP(D17,#REF!,13,0)),\"-\",VLOOKUP(D17,#REF!,13,0))","v":"-"}]
[14,"서울","중부","당인리S/S 154kV #60 BUS","2018년 중부P/O 170kV GIS 정밀점검공사","60-61BUS-SECTION GIS 정밀점검 (시험가압)","2018-09-17 17:00","2018-09-17 18:00","2018-09-17 17:00","2018-09-17 18:00","당일",null,null,null,201807170135,{"$f":"IF(ISERROR(VLOOKUP(D18,#REF!,13,0)),\"-\",VLOOKUP(D18,#REF!,13,0))","v":"-"}]
[15,"서울","중부","당인리S/S 154kV #66 BUS","2018년 중부P/O 170kV GIS 정밀점검공사","#2 BUS-TIE GIS(6200) 정밀점검 (시험가압)","2018-09-19 17:00","2018-09-19 18:00","2018-09-19 17:00","2018-09-19 18:00","당일",null,null,null,201807170143,{"$f":"IF(ISERROR(VLOOKUP(D19,#REF!,13,0)),\"-\",VLOOKUP(D19,#REF!,13,0))","v":"-"}]
[16,"서울","중부","용산동빙고 T/L","154kV 동빙고S/S 인출T/L 선종교체공사","동빙고S/S ~ 첫번째 관로 맨홀 OF-&gtXLPE 선종교체공사","2018-09-10 09:00","2018-10-16 18:00","2018-09-10 09:00","2018-10-16 18:00","연속",null,null,null,201807120109,{"$f":"IF(ISERROR(VLOOKUP(D20,#REF!,13,0)),\"-\",VLOOKUP(D20,#REF!,13,0))","v":"-"}]
[17,"서울","중부","세종로옥인#1 T/L","154kV 옥인 및 운니S/S 인출T/L 교체공사","1. 사업목적 : 옥인 및 운니변전소 화재 및 대형 재난사고 예방 2. 사업구간 : 옥인S/S ∼ 옥인인출전력구, 운니S/S 운니인출전력구 3. 사업내용 - 철거 : 154kV OF 2000㎟ 4C, OF 1200㎟ 4C 총길이1.4㎞ - 신설 : 154kV XLPE 2000㎟ 4C, XLPE 1200㎟ 4C 총길이1.4㎞","2018-09-03 09:00","2018-10-15 18:00","2018-09-03 09:00","2018-10-15 18:00","연속",null,null,null,201807170127,{"$f":"IF(ISERROR(VLOOKUP(D21,#REF!,13,0)),\"-\",VLOOKUP(D21,#REF!,13,0))","v":"-"}]
[18,"남서울","강남","대치논현#1 T/L","대치S/S 장기사용GIS 대체공사","장기사용GIS 대체공사 #1BUS 설치","2018-09-09 10:00","2018-09-10 18:00","2018-09-09 10:00","2018-09-10 18:00","연속",null,null,null,201807200117,{"$f":"IF(ISERROR(VLOOKUP(D22,#REF!,13,0)),\"-\",VLOOKUP(D22,#REF!,13,0))","v":"-"}]
[19,"남서울","강남","대치논현#1 T/L","대치S/S 장기사용GIS 대체공사","대치S/S #2BUS 무부하가압","2018-09-15 16:00","2018-09-15 18:00","2018-09-15 16:00","2018-09-15 18:00","당일",null,null,null,201807180117,{"$f":"IF(ISERROR(VLOOKUP(D23,#REF!,13,0)),\"-\",VLOOKUP(D23,#REF!,13,0))","v":"-"}]
[20,"남서울","강남","대치S/S 154kV #2 BUS","대치S/S 장기사용GIS 대체공사","논현-대치#2T/L, #3M.Tr 1차 GIS 대체 무부하가압","2018-09-30 18:00","2018-10-01 18:00","2018-09-30 18:00","2018-10-01 18:00","연속",null,null,null,201807200068,{"$f":"IF(ISERROR(VLOOKUP(D24,#REF!,13,0)),\"-\",VLOOKUP(D24,#REF!,13,0))","v":"-"}]
[21,"남서울","강남","대치S/S 154kV #1 BUS","대치S/S 장기사용GIS 대체공사","170kV GIS 대체 : 논현-대치#2T/L, #3M.Tr 1차 GIS 23kV GIS 대체 : #3Bank(14CCT)","2018-09-06 10:00","2018-09-12 18:00","2018-09-06 10:00","2018-09-12 18:00","연속",null,null,null,201807180026,{"$f":"IF(ISERROR(VLOOKUP(D25,#REF!,13,0)),\"-\",VLOOKUP(D25,#REF!,13,0))","v":"-"}]
[22,"남서울","강남","대치논현#1 T/L","대치S/S 장기사용GIS 대체공사","대치S/S #2BUS 무부하가압","2018-09-05 16:00","2018-09-05 18:00","2018-09-05 16:00","2018-09-05 18:00","당일",null,null,null,201807180115,{"$f":"IF(ISERROR(VLOOKUP(D26,#REF!,13,0)),\"-\",VLOOKUP(D26,#REF!,13,0))","v":"-"}]
[23,"남서울","강남","대치논현#1 T/L","대치S/S 장기사용GIS 대체공사","대치S/S #1BUS 무부하가압","2018-09-12 16:00","2018-09-12 18:00","2018-09-12 16:00","2018-09-12 18:00","당일",null,null,null,201807180116,{"$f":"IF(ISERROR(VLOOKUP(D27,#REF!,13,0)),\"-\",VLOOKUP(D27,#REF!,13,0))","v":"-"}]
[24,"남서울","강남","대치S/S 154kV #2 BUS","대치S/S 장기사용GIS 대체공사","170kV GIS 대체 : 논현-대치#2T/L, #3M.Tr 1차 GIS 23kV GIS 대체 : #3Bank(14CCT)","2018-09-03 10:00","2018-09-05 18:00","2018-09-03 10:00","2018-09-05 18:00","연속",null,null,null,201807180023,{"$f":"IF(ISERROR(VLOOKUP(D28,#REF!,13,0)),\"-\",VLOOKUP(D28,#REF!,13,0))","v":"-"}]
[25,"남서울","강남","대치논현#1 T/L","대치S/S 장기사용GIS 대체공사","논현-대치#2T/L, #3M.Tr 1차 GIS 대체 무부하가압","2018-09-30 18:00","2018-10-01 18:00","2018-09-30 18:00","2018-10-01 18:00","연속",null,null,null,201807200070,{"$f":"IF(ISERROR(VLOOKUP(D29,#REF!,13,0)),\"-\",VLOOKUP(D29,#REF!,13,0))","v":"-"}]
[26,"남서울","강남","대치S/S 154kV #2 BUS","대치S/S 장기사용GIS 대체공사","170kV GIS 대체 : 논현-대치#2T/L, #3M.Tr 1차 GIS 23kV GIS 대체 : #3Bank(14CCT)","2018-09-13 10:00","2018-09-15 18:00","2018-09-13 10:00","2018-09-15 18:00","연속",null,null,null,201807180027,{"$f":"IF(ISERROR(VLOOKUP(D30,#REF!,13,0)),\"-\",VLOOKUP(D30,#REF!,13,0))","v":"-"}]
[27,"남서울","강남","대치논현#1 T/L","대치S/S 장기사용GIS 대체공사","장기사용GIS 대체공사 #2BUS 설치","2018-09-13 10:00","2018-09-14 18:00","2018-09-13 10:00","2018-09-14 18:00","연속",null,null,null,201807200118,{"$f":"IF(ISERROR(VLOOKUP(D31,#REF!,13,0)),\"-\",VLOOKUP(D31,#REF!,13,0))","v":"-"}]
[28,"남서울","강남","대치논현#2 T/L","대치S/S 장기사용GIS 대체공사","170kV GIS 대체 : 논현-대치#2T/L, #3M.Tr 1차 GIS 23kV GIS 대체 : #3Bank(14CCT)","2018-09-03 10:00","2018-10-02 18:00","2018-09-03 10:00","2018-10-02 18:00","연속",null,null,null,201807180021,{"$f":"IF(ISERROR(VLOOKUP(D32,#REF!,13,0)),\"-\",VLOOKUP(D32,#REF!,13,0))","v":"-"}]
[29,"남서울","강남","사당신림 T/L","사당S/S 170kV GIS 개폐타임측정 및 조작시험","사당-신림T/L GIS 개폐타임측정 및 조작시험","2018-09-18 10:00","2018-09-18 14:00","취소","취소","당일",null,null,null,201807180035,{"$f":"IF(ISERROR(VLOOKUP(D33,#REF!,13,0)),\"-\",VLOOKUP(D33,#REF!,13,0))","v":"-"}]
[30,"남서울","강남","사당봉천#1 T/L","사당S/S 170kV GIS 개폐타임측정 및 조작시험","사당-봉천#1T/L GIS 개폐타임측정 및 조작시험","2018-09-19 10:00","2018-09-19 14:00","취소","취소","당일",null,null,null,201807180051,{"$f":"IF(ISERROR(VLOOKUP(D34,#REF!,13,0)),\"-\",VLOOKUP(D34,#REF!,13,0))","v":"-"}]
[31,"남서울","강남","사당봉천#2 T/L","사당S/S 170kV GIS 개폐타임측정 및 조작시험","사당-봉천#2T/L GIS 개폐타임측정 및 조작시험","2018-09-19 14:00","2018-09-19 18:00","취소","취소","당일",null,null,null,201807180053,{"$f":"IF(ISERROR(VLOOKUP(D35,#REF!,13,0)),\"-\",VLOOKUP(D35,#REF!,13,0))","v":"-"}]
[32,"남서울","동서울","가락수서#2 T/L","170kV GIS 조작시험","170kV GIS 조작시험","2018-09-10 15:00","2018-09-10 18:00","2018-09-10 15:00","2018-09-10 18:00","당일",null,null,null,201807200093,{"$f":"IF(ISERROR(VLOOKUP(D36,#REF!,13,0)),\"-\",VLOOKUP(D36,#REF!,13,0))","v":"-"}]
[33,"남서울","동서울","가락수서#1 T/L","170kV GIS 보통점검","170kV GIS 보통점검","2018-09-10 09:00","2018-09-10 15:00","2018-09-10 09:00","2018-09-10 15:00","당일",null,null,null,201807200092,{"$f":"IF(ISERROR(VLOOKUP(D37,#REF!,13,0)),\"-\",VLOOKUP(D37,#REF!,13,0))","v":"-"}]
[34,"남서울","동서울","풍납석촌#2 T/L","170kV GIS 정밀점검","170kV GIS 정밀점검","2018-09-19 14:00","2018-09-21 18:00","2018-09-19 14:00","2018-09-21 18:00","연속",null,null,null,201807200091,{"$f":"IF(ISERROR(VLOOKUP(D38,#REF!,13,0)),\"-\",VLOOKUP(D38,#REF!,13,0))","v":"-"}]
[35,"남서울","동서울","풍납석촌#1 T/L","170kV GIS 정밀점검","170kV GIS 정밀점검","2018-09-17 09:00","2018-09-19 14:00","2018-09-17 09:00","2018-09-19 14:00","연속",null,null,null,201807200090,{"$f":"IF(ISERROR(VLOOKUP(D39,#REF!,13,0)),\"-\",VLOOKUP(D39,#REF!,13,0))","v":"-"}]
[36,"남서울","영등포","신광명광명#2 T/L","2018~2019 영등포전력지사 변전협력회사 총액공사","170kV GIS 보통점검","2018-09-04 09:00","2018-09-04 18:00","취소","취소","당일",null,null,null,201807200034,{"$f":"IF(ISERROR(VLOOKUP(D40,#REF!,13,0)),\"-\",VLOOKUP(D40,#REF!,13,0))","v":"-"}]
{"$rows_left_out":382}
{"sheet":"한수원","index":3,"n_rows":5,"n_cols":13,"rows_kept":5,"cut":false,"hidden":false,"merged":[[1,11,2,11],[1,12,2,12],[1,0,2,0],[1,1,2,1],[1,2,2,2],[1,3,2,3],[1,4,2,4],[1,5,2,5],[1,6,1,7],[1,8,1,9],[1,10,2,10]]}
["345kV"]
["번호","1차사업소","사업소","설비명","공사명","공사개요","신청일시",null,"조정일시",null,"작업구분","처리결과\n(Y/N)","처리사유"]
[{"$nulls":6},"시작","종료","시작","종료"]
[3,"한빛본부","3발전소","#5 주변압기","한빛5호기 12차 O/H 중 주변압기\n점검\n* 조작차단기 : CB 7D00, 7D71","○ 주변압기 일반점검\n○ 소내보조변압기 일반점검\n○ 갑종보호계전기 삼중화 개선 및 준공시험","2018-09-28\n10:00","2018-10-24\n16:00","2018-09-27\n09:00","2018-10-20\n18:00","연속"]
[4,"한울본부","1발전소","#1 비상보조변압기","한울1호기 22차 O/H 중 비상보조\n변압기 교체\n* 조작차단기 : CB 7300, 7372","○ 비상보조변압기 교체","2018-09-18\n10:00","2018-10-08\n18:00","2018-09-18\n10:00","2018-10-08\n18:00","연속"]

{"sheet":"중부","index":4,"n_rows":7,"n_cols":13,"rows_kept":7,"cut":false,"hidden":false,"merged":[[2,8,2,9],[2,10,3,10],[2,11,3,11],[2,12,3,12],[0,0,0,6],[2,0,3,0],[2,1,3,1],[2,2,3,2],[2,3,3,3],[2,4,3,4],[2,5,3,5],[2,6,2,7]]}
["2018년도 09월휴전계획표(한국중부발전)"]
["345kV"]
["번호","1차사업소","사업소","설비명","공사명","공사개요","신청일시",null,"조정일시",null,"작업구분","처리결과\n(Y/N)","처리사유"]
[{"$nulls":6},"시작","종료","시작","종료"]
[1,"인천발전본부","복합3호기","인천CC#5,6GT 주변압기(7B00,7B71)","계획예방정비공사(A급)","변압기, GCB 및 IPB 점검,정기검사","2018-09-03 09:00","2018-10-26 18:00","2018-09-03 09:00","2018-10-26 18:00","연속"]
[2,"인천발전본부","복합3호기","인천CC#3ST 주변압기(7B00,7B72)","계획예방정비공사(A급)","변압기, GCB 및 IPB 점검,정기검사","2018-10-27 09:00","2018-11-23 18:00","2018-10-27 09:00","2018-11-23 18:00","연속"]
[3,"보령본부","보령3발","345kV 보령-보령복합(연락) #2 T/L\n(CB 7772, 7872, 7800, 7871, 7200, 7271)","7,8호기 GIS 78Bay \n보통점검","갑종보호계전기 시험 및\nGIS 78Bay 보통점검","2018-10-29 09:00","2018-11-09 17:00","2018-10-29 09:00","2018-11-09 17:00","연속"]